{"text_format":"1","workbook":"xlsx","n_sheets":6,"sheets":["devis","param","devis2","etatDesPrimes","tableauDeBord","jeuneConducteur"],"not_rendered":{"charts":1,"images":0,"macros":1,"external_links":0,"defined_names":16,"comments":0,"pivot_tables":0},"unopened":[],"bounds":{"document_bytes":16777216,"sheet_cells":100000,"rows_first":2000,"rows_last":500,"rows_between":2000,"halvings":0,"cell_chars":16384,"cell_head_chars":4096},"cells_cut":0,"cells_raw":0,"read":"whole","date_system":"1900"}

{"sheet":"devis","index":0,"n_rows":22,"n_cols":5,"rows_kept":22,"cut":false,"hidden":false,"merged":[]}
["Simulation du calcul de la prime annuelle d'assurance auto d'un nouvel assuré"]
[]
["Date du jour",{"$f":"NOW()","v":"2020-02-17T09:27:01.580"}]
[]
["Le véhicule",null,null,"Le contrat"]
["Marque ","Renault",null,"Formule","Différence"]
["Modèle","Clio"]
["Puissance",3,null,"Le véhicule","Année"]
["Immatriculation","DQ-9A7-SQ",{"$f":"IF(AND(ISTEXT(LEFT(B9,2)),ISNUMBER(MID(B9,4,3)),ISTEXT(RIGHT(B9,2))),\"\",\"Erreur\")","v":"Erreur"},"Ancienneté",{"$f":"IF(DATE(YEAR(B3),MONTH(B10),DAY(B10))>B3,YEAR(B3)-YEAR(B10)-1,YEAR(B3)-YEAR(B10))","v":3}]
["Date 1ère immatriculation","2016-03-10"]
["Lieu de stationnement","Jardin clos",null,"Montant de la prime"]
["Bonus - Malus déclaré",0.5,null,"Éléments","Montant"]
["Bonus acquis depuis",9,null,"Vehicule"]
[null,null,null,"Cotisation",{"$f":"IFERROR(VLOOKUP(B8,param!$A$11:$B$22,2,FALSE),\"\")","v":400}]
[null,null,null,"Réduction\nancienneté",{"$f":"-IFERROR(VLOOKUP(E9,param!$E$11:$F$21,2,TRUE)*E14,\"\")","v":-19.600000000000001}]
["Le souscripteur",null,null,"Prime de base",{"$f":"SUM(devis!E14:E15)*VLOOKUP(E6,param!B4:C7,2,FALSE)","v":665.69999999999993}]
["Nom","XUARD"]
["Prénom","Seb "]
["Date de naissance","1965-08-15"]
["Situation","célibataire"]
["Date d'obtention du permis","1985-07-01"]
["Usage","privés et trajets travail "]

{"sheet":"param","index":1,"n_rows":142,"n_cols":31,"rows_kept":142,"cut":false,"hidden":false,"merged":[]}
["Paramètres"]
[null,null,null,null,null,null,null,null,null,null,null,null,null,null,null,null,null,null,null,null,1,2,3,4,5,6,7,8,9,10,11]
["Type contrat","Nom du contrat","Coefficient",null,"Taxes et frais","%",null,null,null,null,null,null,null,null,null,null,null,null,null,null,"Audi","BMW","Citroen","Dacia","Fiat","Ford","Mercedes","Peugeot","Renault","Toyota","Volkswagen"]
[1,"Initiale",1,null,"Fiscale",0.33,null,null,null,null,null,null,null,null,null,null,null,null,null,null,"A1","I8","Berlingo","Duster","500","C-MAX","Classe A","107","Captur","Auris","Amarok"]
[2,"Essentiel",1.24,null,"Protection",0.02,null,null,null,null,null,null,null,null,null,null,null,null,null,null,"A3","Serie 1","C1","Logan","500c","Fiesta","Classe B","206","Clio","Avensis","Crafter"]
[3,"Différence",1.75,null,null,null,null,null,null,null,null,null,null,null,null,null,null,null,null,null,"A4","Serie 2","C2","Sandero","Ducato","Focus","Classe C","207","Espace","Aygo","Eos"]
[4,"Plénitude",2.2000000000000002,null,"Frais de gestion",0.13819999999999999,null,null,null,null,null,null,null,null,null,null,null,null,null,null,"A5","Serie 3","C3",null,"Grande","Fusion","Classe clk","208","Kadjar","Corolla","Fox"]
[null,null,null,null,null,null,null,null,null,null,null,null,null,null,null,null,null,null,null,null,"A6","Serie 4","C4",null,"Panda","Ka","Classe cls","307","Kangoo","Iq","Golf"]
["Base prime",null,null,null,"Véhicule",null,null,null,null,null,null,null,null,"Marque",null,null,null,null,null,null,"A7","Serie 5","C5",null,"Punto","Kuga","Classe E","308","Koleos","Land","Multivan"]
["CV","Prime",null,null,"Age","Réduction ",null,null,null,null,null,null,null,"num","Nom",null,"Modèle",null,null,null,"A8","Serie 7","C6",null,"Scudo","Mondeo","Classe glc","406","Laguna","Prius","Passat"]
[2,350,null,null,0,0,null,null,null,null,null,null,null,1,"Audi",null,"Marque","Modèle","Puissance fiscale",null,"Q3","X1","C8",null,null,"S-MAX","Classe gle","407","Master","Prius+","Polo"]
[3,400,null,null,1,0,null,null,null,null,null,null,null,2,"BMW",null,1,"A1",5,null,"Q5","X3","Ds3",null,null,"Transit","Classe glk","508","Megane","Rav4","Scirocco"]
[4,450,null,null,2,2.5000000000000001E-2,null,null,null,null,null,null,null,3,"Citroen",null,1,"A3",4,null,"Q7","X4","Ds4",null,null,null,"Classe m","807","Mégane","Verso","Sharan"]
[5,500,null,null,3,4.9000000000000002E-2,null,null,null,null,null,null,null,4,"Dacia",null,1,"A4",5,null,"SQ5","X5","Ds5",null,null,null,"Classe R","1007","scenic","Yaris","Tiguan"]
[6,550,null,null,4,7.2999999999999995E-2,null,null,null,null,null,null,null,5,"Fiat",null,1,"A5",8,null,null,"X6","Jumper",null,null,null,"SLK","2008","scénic",null,"Touareg"]
[7,610,null,null,5,9.6000000000000002E-2,null,null,null,null,null,null,null,6,"Ford",null,1,"A6",8,null,null,null,"Jumpy",null,null,null,"Sprinter","3008","Super",null,"Touran"]
[8,650,null,null,6,0.11899999999999999,null,null,null,null,null,null,null,7,"Mercedes",null,1,"A7",8,null,null,null,"Saxo",null,null,null,"Vito","4007","Trafic"]
[9,710,null,null,7,0.14099999999999999,null,null,null,null,null,null,null,8,"Peugeot",null,1,"A8",12,null,null,null,"Xsara",null,null,null,null,"5008","Twingo"]
[10,750,null,null,8,0.16200000000000001,null,null,null,null,null,null,null,9,"Renault",null,1,"Q3",5,null,null,null,null,null,null,null,null,"206+"]
[11,800,null,null,9,0.183,null,null,null,null,null,null,null,10,"Toyota",null,1,"Q5",5,null,null,null,null,null,null,null,null,"Boxer"]
[12,850,null,null,10,0.20399999999999999,null,null,null,null,null,null,null,11,"Volkswagen",null,1,"Q7",8,null,null,null,null,null,null,null,null,"Expert"]
[13,900,null,null,null,null,null,null,null,null,null,null,null,null,null,null,1,"SQ5",8,null,null,null,null,null,null,null,null,"Partner"]
[null,null,null,null,null,null,null,null,null,null,null,null,null,null,null,null,1,"TT",5,null,null,null,null,null,null,null,null,"Rcz"]
[null,null,null,null,null,null,null,null,null,null,null,null,null,null,null,null,2,"I8",3]
[null,null,null,null,null,null,null,null,null,null,null,null,null,null,null,null,2,"Serie 1",5]
[null,null,null,null,null,null,null,null,null,null,null,null,null,null,null,null,2,"Serie 2",3]
[null,null,null,null,null,null,null,null,null,null,null,null,null,null,null,null,2,"Serie 3",5]
[null,null,null,null,null,null,null,null,null,null,null,null,null,null,null,null,2,"Serie 4",5]
[null,null,null,null,null,null,null,null,null,null,null,null,null,null,null,null,2,"Serie 5",8]
[null,null,null,null,null,null,null,null,null,null,null,null,null,null,null,null,2,"Serie 7",13]
[null,null,null,null,null,null,null,null,null,null,null,null,null,null,null,null,2,"X1",5]
[null,null,null,null,null,null,null,null,null,null,null,null,null,null,null,null,2,"X3",5]
[null,null,null,null,null,null,null,null,null,null,null,null,null,null,null,null,2,"X4",8]
[null,null,null,null,null,null,null,null,null,null,null,null,null,null,null,null,2,"X5",8]
[null,null,null,null,null,null,null,null,null,null,null,null,null,null,null,null,2,"X6",8]
[null,null,null,null,null,null,null,null,null,null,null,null,null,null,null,null,3,"Berlingo",4]
[null,null,null,null,null,null,null,null,null,null,null,null,null,null,null,null,3,"C1",2]
[null,null,null,null,null,null,null,null,null,null,null,null,null,null,null,null,3,"C2",3]
[null,null,null,null,null,null,null,null,null,null,null,null,null,null,null,null,3,"C3",3]
[null,null,null,null,null,null,null,null,null,null,null,null,null,null,null,null,3,"C4",4]
[null,null,null,null,null,null,null,null,null,null,null,null,null,null,null,null,3,"C5",5]
[null,null,null,null,null,null,null,null,null,null,null,null,null,null,null,null,3,"C6",7]
[null,null,null,null,null,null,null,null,null,null,null,null,null,null,null,null,3,"C8",6]
[null,null,null,null,null,null,null,null,null,null,null,null,null,null,null,null,3,"Ds3",4]
[null,null,null,null,null,null,null,null,null,null,null,null,null,null,null,null,3,"Ds4",5]
[null,null,null,null,null,null,null,null,null,null,null,null,null,null,null,null,3,"Ds5",5]
[null,null,null,null,null,null,null,null,null,null,null,null,null,null,null,null,3,"Jumper",5]
[null,null,null,null,null,null,null,null,null,null,null,null,null,null,null,null,3,"Jumpy",5]
[null,null,null,null,null,null,null,null,null,null,null,null,null,null,null,null,3,"Saxo",2]
[null,null,null,null,null,null,null,null,null,null,null,null,null,null,null,null,3,"Xsara",4]
[null,null,null,null,null,null,null,null,null,null,null,null,null,null,null,null,4,"Duster",3]
[null,null,null,null,null,null,null,null,null,null,null,null,null,null,null,null,4,"Logan",3]
[null,null,null,null,null,null,null,null,null,null,null,null,null,null,null,null,4,"Sandero",3]
[null,null,null,null,null,null,null,null,null,null,null,null,null,null,null,null,5,"500",2]
[null,null,null,null,null,null,null,null,null,null,null,null,null,null,null,null,5,"500c",2]
[null,null,null,null,null,null,null,null,null,null,null,null,null,null,null,null,5,"Ducato",6]
[null,null,null,null,null,null,null,null,null,null,null,null,null,null,null,null,5,"Grande",2]
[null,null,null,null,null,null,null,null,null,null,null,null,null,null,null,null,5,"Panda",2]
[null,null,null,null,null,null,null,null,null,null,null,null,null,null,null,null,5,"Punto",2]
[null,null,null,null,null,null,null,null,null,null,null,null,null,null,null,null,5,"Scudo",5]
{"$rows_left_out":83}
{"sheet":"devis2","index":2,"n_rows":22,"n_cols":5,"rows_kept":22,"cut":false,"hidden":false,"merged":[]}
["Simulation du calcul de la prime annuelle d'assurance auto d'un nouvel assuré"]
[]
["Date du jour",{"$f":"NOW()","v":"2020-02-17T09:27:01.580"}]
[]
["Le véhicule",null,null,"Le contrat"]
["Marque ","Renault",null,"Formule","Différence"]
["Modèle","Clio"]
["Puissance",3,null,"Montant de la prime"]
["Immatriculation","DQ-9A7-SQ",{"$f":"IF(AND(ISTEXT(LEFT(B9,2)),ISNUMBER(MID(B9,4,3)),ISTEXT(RIGHT(B9,2))),\"\",\"Erreur\")","v":"Erreur"},"Eléments","Montant"]
["Ancienneté véhicule","2016-02-10",null,"Vehicule"]
["Lieu de stationnement","Jardin clos",null,"Puissance",{"$f":"IFERROR(VLOOKUP(B8,param!$A$11:$B$22,2,TRUE),\"\")","v":400}]
["Bonus - Malus déclaré",2.5,null,"Age",{"$f":"IFERROR(VLOOKUP(B8,param!$A$11:$B$22,2,TRUE),\"\")","v":400}]
["Bonus acquis depuis",9,null,"Prime de base",{"$f":"SUM(E11:E12)*VLOOKUP(E6,param!$B$4:$C$7,2,FALSE)","v":1400}]
[]
[]
["Le souscripteur"]
["Nom","XUARD"]
["Prénom","Seb "]
["Date de naissance","1965-08-15"]
["Situation","célibataire"]
["Date d'obtention du permis","1985-07-01"]
["Usage","privés et trajets travail "]

{"sheet":"etatDesPrimes","index":3,"n_rows":377,"n_cols":11,"rows_kept":377,"cut":false,"hidden":false,"merged":[]}
["Prime annuelle des 4 dernières années"]
[]
["Année",2019]
[null,null,null,"Année en cours",null,null,null,null,"Rappel années antérieures"]
["nom","prénom","Type contrat","Prime pure","Bonus malus","Montant HT","Frais et taxes",2019,2018,2017,2016]
["Morizet","Yann","Essentiel",448,0.51,{"$f":"D6*E6","v":228.48000000000002},{"$f":"F6*0.16","v":36.556800000000003},{"$f":"ROUND(F6+G6,2)","v":265.04000000000002},332.6,302.36,314.45]
["Watier","Guillaume","Différence",1249,1.9,{"$f":"D7*E7","v":2373.1},{"$f":"F7*0.16","v":379.69599999999997},{"$f":"ROUND(F7+G7,2)","v":2752.8},724.42,696.56,724.42]
["Henry","Charline","Essentiel",1755,0.5,{"$f":"D8*E8","v":877.5},140.4,1017.9,1180.76,1227.99,1180.76]
["Cerdan","Axel","Initiale",385,1.55,596.75,95.48,692.23,334.95,290.29000000000002,279.13]
["Bouzouba","Yassine","Différence",966,0.93,898.38,143.74080000000001,1042.1199999999999,672.34,699.23,726.12]
["Amit","Hagay","Plénitude",444,0.72,319.68,51.148800000000001,370.83,293.57,293.57,305.32]
["Mourgues","Regis","Différence",611,1.93,1179.23,188.67680000000001,1367.91,439.43,351.54,0]
["Diot","Herve","Essentiel",421,0.61,256.81,41.089600000000004,297.89999999999998,263.70999999999998,273.13,235.46]
["Elliot","Mary","Initiale",643,3.41,2192.63,350.82080000000002,2543.4499999999998,477.36,377.62,391.87]
["Hasle-De-Barral","Alexandre","Initiale",387,0.52,201.24,32.198399999999999,233.44,305.27,258.7,269.05]
["Launeau","Patrick","Initiale",446,1.08,481.68,77.068799999999996,558.75,258.68,268.63,248.73]
["Mandin","Louison","Différence",1857,0.5,928.5,148.56,1077.06,1206.31,1206.31,1254.56]
["Langlais","Benoit","Essentiel",406,1.38,560.28,89.644800000000004,649.91999999999996,240.19,226.59,226.59]
["Garibaldi","Cynthia","Plénitude",407,2.06,838.42000000000007,134.14720000000003,972.57,236.06,245.5,236.06]
["Le-Deit","Laetitia","Initiale",423,0.61,258.02999999999997,41.284799999999997,299.31,264.97000000000003,264.97000000000003,264.97000000000003]
["Civet","Francois","Différence",474,0.77,364.98,58.396800000000006,423.38,274.92,264.35000000000002,264.35000000000002]
["Morcrette","Annabelle","Initiale",405,1.33,538.65,86.183999999999997,624.83000000000004,300.67,273.33999999999997,284.27]
["Viard","Sophie","Différence",739,0.5,369.5,59.120000000000005,428.62,505.77,495.85,495.85]
["Denis","Thomas","Initiale",456,0.72,328.32,52.531199999999998,380.85,280.35000000000002,291.56,302.77999999999997]
["Grasset","Olivier","Essentiel",1333,0.5,666.5,106.64,773.14,773.14,743.4,773.14]
["Vacher","Pierre","Essentiel",411,1.17,480.86999999999995,76.9392,557.80999999999995,238.38,229.21,238.38]
["Jorissen","Frans","Différence",1101,0.5,550.5,88.08,638.58000000000004,715.21,752.2,789.2]
["Remy","Cecile","Différence",762,0.5,381,60.96,441.96,654.1,565.41,554.32000000000005]
["Gaudin","Pierre","Initiale",422,0.55000000000000004,232.10000000000002,37.136000000000003,269.24,293.70999999999998,305.01,282.42]
["Geslin","Emmanuelle","Initiale",1553,0.5,776.5,124.24000000000001,900.74,900.74,935.38,970.03]
["Leroux","Alexandre","Initiale",897,0.93,834.21,133.4736,967.68,686.74,597.16999999999996,517.54999999999995]
["Bicchi","Erica","Plénitude",457,0.68,310.76000000000005,49.721600000000009,360.48,318.07,330.79,318.07]
["Metzger","Edouard","Initiale",952,0.78,742.56000000000006,118.80960000000002,861.37,684.68,710.52,0]
["Baltzer","Carla","Différence",1259,0.5,629.5,100.72,730.22,949.29,847.58,847.58]
["Happert","Solene","Initiale",876,0.5,438,70.08,508.08,751.96,644.54,673.83]
["Parent","Briz","Essentiel",1924,0.5,962,153.92000000000002,1115.92,1160.56,1206.98,1253.4000000000001]
["Blanchet","Carlito","Plénitude",1715,0.5,857.5,137.20000000000002,994.7,994.7,1032.96,956.44]
["Thebault","Erwan","Plénitude",1640,2.75,4510,721.6,5231.6000000000004,951.2,951.2,989.25]
["Beaunay","Stephanie","Plénitude",390,3.32,1294.8,207.16800000000001,1501.97,294.06,233.52,242.17]
["Bourgeais","Hugo","Différence",1429,0.5,714.5,114.32000000000001,828.82,878.55,913.69,878.55]
["Francois","Yann","Essentiel",504,0.6,302.39999999999998,48.384,350.78,368.32,385.07,334.84]
["Mercier","Eric","Essentiel",448,0.74,331.52,53.043199999999999,384.56,400.15,419.83,439.51]
["Sauvagnat","Mickael","Différence",680,0.63,428.4,68.543999999999997,496.94,591.6,621.94000000000005,652.28]
["Laffourcade","Roland","Initiale",853,0.67,571.51,91.441599999999994,662.95,494.74,514.53,494.74]
["Keita","Fanta","Différence",1894,0.5,947,151.52000000000001,1098.52,1340.19,1403.02,1214.55]
["Lenta","Laurent","Initiale",789,0.57999999999999996,457.61999999999995,73.219199999999987,530.84,658.97,685.33,720.48]
["Boucetta","Ali","Essentiel",451,0.75,338.25,54.120000000000005,392.37,313.89999999999998,325.97000000000003,338.04]
["Puig","Clemence","Initiale",428,0.61,261.08,41.772799999999997,302.85000000000002,302.85000000000002,317.05,331.25]
["Mocquet","Antoine","Différence",453,1.94,878.81999999999994,140.6112,1019.43,273.25,253.01,263.13]
["Aussenac","Raphael","Initiale",392,0.56999999999999995,223.43999999999997,35.750399999999999,259.19,227.36,218.62,227.36]
["Girardeau","Jacques","Initiale",1837,0.99,1818.6299999999999,290.98079999999999,2109.61,1555.57,1228.08,1064.3399999999999]
["Zanella","Alain","Essentiel",427,2.48,1058.96,169.43360000000001,1228.3900000000001,297.19,311.33999999999997,325.5]
["Bosse","Luzia","Initiale",410,2.76,1131.5999999999999,181.05599999999998,1312.66,256.82,256.82,256.82]
["Carpy","Sabrina","Essentiel",706,0.75,529.5,84.72,614.22,475,475,494]
["Schiebel","Ralf","Différence",782,2.59,2025.3799999999999,324.06079999999997,2349.44,571.49,594.35,617.20000000000005]
["Strzerzynski","Pierre","Essentiel",387,0.6,232.2,37.152000000000001,269.35000000000002,341.18,358.24,311.33]
["Ndjao","Mayabassim","Plénitude",755,0.71,536.04999999999995,85.768000000000001,621.82000000000005,665.61,698.89,557.45000000000005]
["Le-Menn","Erwan","Initiale",1939,2.61,5060.79,809.72640000000001,5870.52,1124.6199999999999,1124.6199999999999,1124.6199999999999]
["Masse","Marion","Plénitude",448,0.52,232.96,37.273600000000002,270.23,259.83999999999997,259.83999999999997,259.83999999999997]
["Denis","David","Initiale",747,0.61,455.67,72.907200000000003,528.58000000000004,450.59,450.59,468.61]
{"$rows_left_out":318}
{"sheet":"tableauDeBord","index":4,"n_rows":10,"n_cols":5,"rows_kept":10,"cut":false,"hidden":false,"merged":[]}
["Statistiques sur la mise en place de la tarification jeune conducteur"]
[]
[]
["évolution de la répartition des primes par type de contrat"]
[null,2019,2018,2017,2016]
["Initiale",{"$f":"SUMIFS(etatDesPrimes!H$6:H$377,etatDesPrimes!$C$6:$C$377,tableauDeBord!$A6)","v":127792.18000000004},{"$f":"SUMIFS(etatDesPrimes!I$6:I$377,etatDesPrimes!$C$6:$C$377,tableauDeBord!$A6)","v":111880.83999999998},{"$f":"SUMIFS(etatDesPrimes!J$6:J$377,etatDesPrimes!$C$6:$C$377,tableauDeBord!$A6)","v":103458.59999999999},{"$f":"SUMIFS(etatDesPrimes!K$6:K$377,etatDesPrimes!$C$6:$C$377,tableauDeBord!$A6)","v":95961.39999999998}]
["Essentiel",{"$f":"SUMIFS(etatDesPrimes!H$6:H$377,etatDesPrimes!$C$6:$C$377,tableauDeBord!$A7)","v":87269.280000000013},{"$f":"SUMIFS(etatDesPrimes!I$6:I$377,etatDesPrimes!$C$6:$C$377,tableauDeBord!$A7)","v":64281.280000000006},{"$f":"SUMIFS(etatDesPrimes!J$6:J$377,etatDesPrimes!$C$6:$C$377,tableauDeBord!$A7)","v":58364.899999999987},{"$f":"SUMIFS(etatDesPrimes!K$6:K$377,etatDesPrimes!$C$6:$C$377,tableauDeBord!$A7)","v":52450.19}]
["Différence",{"$f":"SUMIFS(etatDesPrimes!H$6:H$377,etatDesPrimes!$C$6:$C$377,tableauDeBord!$A8)","v":72278.920000000013},{"$f":"SUMIFS(etatDesPrimes!I$6:I$377,etatDesPrimes!$C$6:$C$377,tableauDeBord!$A8)","v":85204.060000000027},{"$f":"SUMIFS(etatDesPrimes!J$6:J$377,etatDesPrimes!$C$6:$C$377,tableauDeBord!$A8)","v":80090.579999999987},{"$f":"SUMIFS(etatDesPrimes!K$6:K$377,etatDesPrimes!$C$6:$C$377,tableauDeBord!$A8)","v":74393.91}]
["Plénitude",{"$f":"SUMIFS(etatDesPrimes!H$6:H$377,etatDesPrimes!$C$6:$C$377,tableauDeBord!$A9)","v":58769.32999999998},{"$f":"SUMIFS(etatDesPrimes!I$6:I$377,etatDesPrimes!$C$6:$C$377,tableauDeBord!$A9)","v":58072.040000000008},{"$f":"SUMIFS(etatDesPrimes!J$6:J$377,etatDesPrimes!$C$6:$C$377,tableauDeBord!$A9)","v":56305.840000000011},{"$f":"SUMIFS(etatDesPrimes!K$6:K$377,etatDesPrimes!$C$6:$C$377,tableauDeBord!$A9)","v":48817.969999999994}]
["Total primes",{"$f":"SUM(B6:B9)","v":346109.71},{"$f":"SUM(C6:C9)","v":319438.22000000003},298219.92,271623.46999999997]

{"sheet":"jeuneConducteur","index":5,"n_rows":377,"n_cols":11,"rows_kept":377,"cut":false,"hidden":false,"merged":[]}
["Mise en place de la tarification jeune conducteur"]
[]
["Année",2019]
[null,null,null,null,null,null,null,null,"Sinistres","Surprime"]
["nom","prénom","Type contrat","Prime de \nbase","Année du \npermis","1er contrat \n(O/N)","Formation anticipée (O/N)","Année ouverture contrat",2018,2018,{"$f":"B3","v":2019}]
["Lamiaux","Karine","Essentiel",500,2016,"O","n",2018,0,{"$f":"surprime($D6,$G6,J$5,$H6)","v":1000},{"$f":"surprime(D6,G6,K$5,$H6,I6)","v":750}]
["Brossillon","Frederique","Différence",869,2016,"O","O",2018,0,{"$f":"surprime($D7,$G7,J$5,$H7)","v":1303.5},{"$f":"surprime(D7,G7,K$5,$H7,I7)","v":1086.25}]
["Barat","René","Essentiel",765,2017,"O","N",2018,1,1530,1530]
["Faure","Colette","Initiale",638,2019,"O","O",2019,0,0,957]
["Longeat","Carine","Différence",541,2017,"O","O",2019,0,0,811.5]
["Durupt","Marie Laure","Plénitude",590,2017,"N","O",2018,0,885,737.5]
["Meneroud","Yann","Différence",563,2018,"O","N",2018,0,1126,844.5]
["Emeric","Michel","Essentiel",571,2016,"O","O",2018,0,856.5,713.75]
["Fehmi","Chakib","Initiale",506,2017,"O","O",2018,1,759,759]
["Ferre","Emmanuel","Initiale",754,2019,"O","O",2019,0,0,1131]
["Miler","Gloria","Initiale",938,2016,"O","O",2018,0,1407,1172.5]
["Rigaud","Jean francois","Différence",564,2019,"O","O",2018,0,846,705]
["Gelpe","Martine","Essentiel",700.6,2018,"N","O",2018,0,1050.9000000000001,875.75]
["Perrault","Christine","Plénitude",1665.4,2016,"O","N",2018,0,3330.8,2498.1000000000004]
["Genest","Marie therese","Initiale",832,2016,"O","O",2018,0,1248,1040]
["Baba","Martine","Différence",1300.25,2016,"O","O",2018,0,1950.375,1625.3125]
["Barat","Nicole","Initiale",833,2018,"O","O",2018,0,1249.5,1041.25]
["Coste","Laurent","Différence",1389.5,2017,"O","N",2018,0,2779,2084.25]
["Meyer","Denis","Initiale",572,2019,"O","O",2019,0,0,858]
["Chanac","Sylvie","Essentiel",672.08,2016,"O","O",2018,0,1008.1200000000001,840.1]
["Marquette","Lucien","Essentiel",872.96,2018,"O","N",2018,0,1745.92,1309.44]
["Masina","Mohamed","Différence",889,2016,"O","O",2018,0,1333.5,1111.25]
["Verdier","Philippe","Différence",894.25,2016,"O","O",2018,0,1341.375,1117.8125]
["Foulon","Monique","Initiale",716,2017,"O","O",2018,0,1074,895]
["Del cuerpo","Daniele","Initiale",927,2018,"O","O",2018,0,1390.5,1158.75]
["Catala","Carole","Initiale",922,2018,"O","O",2018,0,1383,1152.5]
["Dierstein","Anna","Plénitude",2087.8000000000002,2018,"O","O",2018,1,3131.7000000000003,3131.7000000000003]
["Le morvan","Pascale","Initiale",891,2016,"O","O",2018,0,1336.5,1113.75]
["Polidori","Francoise","Différence",1557.5,2016,"O","O",2018,0,2336.25,1946.875]
["Blanc","Marie therese","Initiale",588,2018,"O","O",2018,0,882,735]
["Tardy","Jean michel","Essentiel",815.92,2016,"O","N",2018,0,1631.84,1223.8799999999999]
["Enger","Michel","Plénitude",1940.4,2018,"O","O",2018,0,2910.6000000000004,2425.5]
["Badefort","Elmostafa","Plénitude",1218.8000000000002,2016,"O","O",2018,0,1828.1999999999998,1523.5]
["Herviou","Anne","Plénitude",1326.6000000000001,2017,"O","N",2018,0,2653.2,1989.8999999999999]
["Trassoudaine","Thi thu huong","Différence",973,2016,"O","O",2018,0,1459.5,1216.25]
["Samkawi","Sylvia","Essentiel",1147,2016,"O","O",2018,0,1720.5,1433.75]
["Parazols","Raymond","Essentiel",696.88,2018,"O","O",2018,0,1045.32,871.1]
["Gaillard","Michele","Différence",1055.25,2018,"O","O",2018,0,1582.875,1319.0625]
["Martory","Christiane","Initiale",928,2016,"O","N",2018,0,1856,1392]
["Seffar","Bernadette","Différence",1352.75,2019,"O","N",2019,0,0,2705.5]
["Talbart","Stephane","Initiale",798,2018,"N","O",2018,0,1197,997.5]
["Pasquereau","Jean luc","Essentiel",620,2017,"O","O",2018,0,930,775]
["Poire","Thierry","Initiale",945,2017,"O","O",2018,1,1417.5,1417.5]
["Melloul","Pascale","Différence",955.5,2016,"O","O",2018,0,1433.25,1194.375]
["Cherubin","Anna","Initiale",776,2016,"O","O",2018,0,1164,970]
["Sardi","Robert","Initiale",915,2018,"O","O",2018,0,1372.5,1143.75]
["Departout","Francois","Essentiel",716.72,2016,"O","N",2018,0,1433.44,1075.08]
["Decourtray","Annick","Initiale",684,2016,"O","O",2018,1,1026,1026]
["Gosselet","Bernard","Essentiel",947.36,2018,"N","O",2018,0,1421.04,1184.2]
["Plegues","Nicole","Différence",1400,2019,"O","N",2019,0,0,2800]
["Thune","Sylvie","Essentiel",1050.28,2016,"O","N",2018,1,2100.56,2100.56]
["Bigarre","Nicole","Plénitude",1232,2016,"O","N",2018,1,2464,2464]
["Thoisy","Helene","Initiale",873,2019,"O","N",2019,0,0,1746]
["De simone","Micheline","Plénitude",1161.6000000000001,2016,"O","O",2018,1,1742.3999999999999,1742.3999999999999]
["Bensimon","Said","Initiale",564,2019,"O","N",2019,0,0,1128]
{"$rows_left_out":317}